• Posts

    • It works! The problem was the diferent config files betwen server and client, but now i have another problem, not related to this topic, so we can mark as solved, and i will open another topic. Thank you!
    • I have tried selecting  gradle on the right side bar then selected Tasks>fg_runs>genIntellijRuns but my mod still doesn't run   I got this after selecting Run 'runClient'   # # A fatal error has been detected by the Java Runtime Environment: # # EXCEPTION_ACCESS_VIOLATION (0xc0000005) at pc=0x0000000000000000, pid=18340, tid=0x0000000000000908 # # JRE version: Java(TM) SE Runtime Environment (8.0_251-b08) (build 1.8.0_251-b08) # Java VM: Java HotSpot(TM) 64-Bit Server VM (25.251-b08 mixed mode windows-amd64 compressed oops) # Problematic frame: # C 0x0000000000000000 # # Failed to write core dump. Minidumps are not enabled by default on client versions of Windows # # An error report file with more information is saved as: # C:\Users\titre\Desktop\Coding-Scripting\MyMinecraftModding\TutorialMod\run\hs_err_pid18340.log # # If you would like to submit a bug report, please visit: # http://bugreport.java.com/bugreport/crash.jsp # The crash happened outside the Java Virtual Machine in native code. # See problematic frame for where to report the bug. # Process finished with exit code 1  
    • ---- Minecraft Crash Report ---- // I let you down. Sorry :( Time: 5/29/20 10:03 AM Description: Rendering overlay com.electronwill.nightconfig.core.io.ParsingException: Not enough data available     at com.electronwill.nightconfig.core.io.ParsingException.notEnoughData(ParsingException.java:22) ~[core-3.6.2.jar:?] {}     at com.electronwill.nightconfig.core.io.ReaderInput.directReadChar(ReaderInput.java:36) ~[core-3.6.2.jar:?] {}     at com.electronwill.nightconfig.core.io.AbstractInput.readChar(AbstractInput.java:49) ~[core-3.6.2.jar:?] {}     at com.electronwill.nightconfig.core.io.AbstractInput.readCharsUntil(AbstractInput.java:123) ~[core-3.6.2.jar:?] {}     at com.electronwill.nightconfig.toml.TableParser.parseKey(TableParser.java:166) ~[toml-3.6.2.jar:?] {}     at com.electronwill.nightconfig.toml.TableParser.parseDottedKey(TableParser.java:145) ~[toml-3.6.2.jar:?] {}     at com.electronwill.nightconfig.toml.TableParser.parseNormal(TableParser.java:55) ~[toml-3.6.2.jar:?] {}     at com.electronwill.nightconfig.toml.TomlParser.parse(TomlParser.java:44) ~[toml-3.6.2.jar:?] {}     at com.electronwill.nightconfig.toml.TomlParser.parse(TomlParser.java:37) ~[toml-3.6.2.jar:?] {}     at com.electronwill.nightconfig.core.io.ConfigParser.parse(ConfigParser.java:113) ~[core-3.6.2.jar:?] {}     at com.electronwill.nightconfig.core.io.ConfigParser.parse(ConfigParser.java:219) ~[core-3.6.2.jar:?] {}     at com.electronwill.nightconfig.core.io.ConfigParser.parse(ConfigParser.java:202) ~[core-3.6.2.jar:?] {}     at com.electronwill.nightconfig.core.file.WriteSyncFileConfig.load(WriteSyncFileConfig.java:73) ~[core-3.6.2.jar:?] {}     at com.electronwill.nightconfig.core.file.AutosaveCommentedFileConfig.load(AutosaveCommentedFileConfig.java:85) ~[core-3.6.2.jar:?] {}     at net.minecraftforge.fml.config.ConfigFileTypeHandler.lambda$reader$1(ConfigFileTypeHandler.java:53) ~[?:?] {re:classloading}     at net.minecraftforge.fml.config.ConfigFileTypeHandler$$Lambda$3923/1217818289.apply(Unknown Source) ~[?:?] {}     at net.minecraftforge.fml.config.ConfigTracker.openConfig(ConfigTracker.java:104) ~[?:?] {re:classloading}     at net.minecraftforge.fml.config.ConfigTracker.lambda$loadConfigs$1(ConfigTracker.java:83) ~[?:?] {re:classloading}     at net.minecraftforge.fml.config.ConfigTracker$$Lambda$3922/1701184223.accept(Unknown Source) ~[?:?] {}     at java.lang.Iterable.forEach(Iterable.java:75) ~[?:1.8.0_51] {}     at java.util.Collections$SynchronizedCollection.forEach(Collections.java:2062) ~[?:1.8.0_51] {}     at net.minecraftforge.fml.config.ConfigTracker.loadConfigs(ConfigTracker.java:83) ~[?:?] {re:classloading}     at net.minecraftforge.fml.ModLoader.lambda$null$5(ModLoader.java:153) ~[?:?] {re:classloading}     at net.minecraftforge.fml.ModLoader$$Lambda$3921/1057326871.run(Unknown Source) ~[?:?] {}     at net.minecraftforge.fml.DistExecutor.unsafeRunWhenOn(DistExecutor.java:125) ~[?:?] {re:classloading}     at net.minecraftforge.fml.DistExecutor.runWhenOn(DistExecutor.java:109) ~[?:?] {re:classloading}     at net.minecraftforge.fml.ModLoader.loadMods(ModLoader.java:153) ~[?:?] {re:classloading}     at net.minecraftforge.fml.client.ClientModLoader.lambda$startModLoading$6(ClientModLoader.java:123) ~[?:?] {re:classloading,pl:runtimedistcleaner:A}     at net.minecraftforge.fml.client.ClientModLoader$$Lambda$3916/1226026499.run(Unknown Source) ~[?:?] {}     at net.minecraftforge.fml.client.ClientModLoader.lambda$createRunnableWithCatch$5(ClientModLoader.java:113) ~[?:?] {re:classloading,pl:runtimedistcleaner:A}     at net.minecraftforge.fml.client.ClientModLoader$$Lambda$2073/51757185.run(Unknown Source) ~[?:?] {}     at net.minecraftforge.fml.client.ClientModLoader.startModLoading(ClientModLoader.java:123) ~[?:?] {re:classloading,pl:runtimedistcleaner:A}     at net.minecraftforge.fml.client.ClientModLoader.lambda$onreload$3(ClientModLoader.java:105) ~[?:?] {re:classloading,pl:runtimedistcleaner:A}     at net.minecraftforge.fml.client.ClientModLoader$$Lambda$3888/1519451306.run(Unknown Source) ~[?:?] {}     at net.minecraftforge.fml.client.ClientModLoader.lambda$createRunnableWithCatch$5(ClientModLoader.java:113) ~[?:?] {re:classloading,pl:runtimedistcleaner:A}     at net.minecraftforge.fml.client.ClientModLoader$$Lambda$2073/51757185.run(Unknown Source) ~[?:?] {}     at java.util.concurrent.CompletableFuture$AsyncRun.run(CompletableFuture.java:1618) ~[?:1.8.0_51] {}     at java.util.concurrent.CompletableFuture$AsyncRun.exec(CompletableFuture.java:1610) ~[?:1.8.0_51] {}     at java.util.concurrent.ForkJoinTask.doExec(ForkJoinTask.java:289) ~[?:1.8.0_51] {}     at java.util.concurrent.ForkJoinPool$WorkQueue.runTask(ForkJoinPool.java:1056) ~[?:1.8.0_51] {}     at java.util.concurrent.ForkJoinPool.runWorker(ForkJoinPool.java:1689) ~[?:1.8.0_51] {}     at java.util.concurrent.ForkJoinWorkerThread.run(ForkJoinWorkerThread.java:157) ~[?:1.8.0_51] {} A detailed walkthrough of the error, its code path and all known details is as follows: --------------------------------------------------------------------------------------- -- Head -- Thread: Render thread Stacktrace:     at com.electronwill.nightconfig.core.io.ParsingException.notEnoughData(ParsingException.java:22)     at com.electronwill.nightconfig.core.io.ReaderInput.directReadChar(ReaderInput.java:36)     at com.electronwill.nightconfig.core.io.AbstractInput.readChar(AbstractInput.java:49)     at com.electronwill.nightconfig.core.io.AbstractInput.readCharsUntil(AbstractInput.java:123)     at com.electronwill.nightconfig.toml.TableParser.parseKey(TableParser.java:166)     at com.electronwill.nightconfig.toml.TableParser.parseDottedKey(TableParser.java:145)     at com.electronwill.nightconfig.toml.TableParser.parseNormal(TableParser.java:55)     at com.electronwill.nightconfig.toml.TomlParser.parse(TomlParser.java:44)     at com.electronwill.nightconfig.toml.TomlParser.parse(TomlParser.java:37)     at com.electronwill.nightconfig.core.io.ConfigParser.parse(ConfigParser.java:113)     at com.electronwill.nightconfig.core.io.ConfigParser.parse(ConfigParser.java:219)     at com.electronwill.nightconfig.core.io.ConfigParser.parse(ConfigParser.java:202)     at com.electronwill.nightconfig.core.file.WriteSyncFileConfig.load(WriteSyncFileConfig.java:73)     at com.electronwill.nightconfig.core.file.AutosaveCommentedFileConfig.load(AutosaveCommentedFileConfig.java:85)     at net.minecraftforge.fml.config.ConfigFileTypeHandler.lambda$reader$1(ConfigFileTypeHandler.java:53)     at net.minecraftforge.fml.config.ConfigFileTypeHandler$$Lambda$3923/1217818289.apply(Unknown Source)     at net.minecraftforge.fml.config.ConfigTracker.openConfig(ConfigTracker.java:104)     at net.minecraftforge.fml.config.ConfigTracker.lambda$loadConfigs$1(ConfigTracker.java:83)     at net.minecraftforge.fml.config.ConfigTracker$$Lambda$3922/1701184223.accept(Unknown Source)     at java.lang.Iterable.forEach(Iterable.java:75)     at java.util.Collections$SynchronizedCollection.forEach(Collections.java:2062)     at net.minecraftforge.fml.config.ConfigTracker.loadConfigs(ConfigTracker.java:83)     at net.minecraftforge.fml.ModLoader.lambda$null$5(ModLoader.java:153)     at net.minecraftforge.fml.ModLoader$$Lambda$3921/1057326871.run(Unknown Source)     at net.minecraftforge.fml.DistExecutor.unsafeRunWhenOn(DistExecutor.java:125)     at net.minecraftforge.fml.DistExecutor.runWhenOn(DistExecutor.java:109)     at net.minecraftforge.fml.ModLoader.loadMods(ModLoader.java:153) -- Overlay render details -- Details:     Overlay name: net.minecraft.client.gui.ResourceLoadProgressGui Stacktrace:     at net.minecraft.client.renderer.GameRenderer.func_195458_a(GameRenderer.java:472)     at net.minecraft.client.Minecraft.func_195542_b(Minecraft.java:924)     at net.minecraft.client.Minecraft.func_99999_d(Minecraft.java:553)     at net.minecraft.client.main.Main.main(SourceFile:204)     at sun.reflect.NativeMethodAccessorImpl.invoke0(Native Method)     at sun.reflect.NativeMethodAccessorImpl.invoke(NativeMethodAccessorImpl.java:62)     at sun.reflect.DelegatingMethodAccessorImpl.invoke(DelegatingMethodAccessorImpl.java:43)     at java.lang.reflect.Method.invoke(Method.java:497)     at net.minecraftforge.fml.loading.FMLClientLaunchProvider.lambda$launchService$0(FMLClientLaunchProvider.java:51)     at net.minecraftforge.fml.loading.FMLClientLaunchProvider$$Lambda$436/703440120.call(Unknown Source)     at cpw.mods.modlauncher.LaunchServiceHandlerDecorator.launch(LaunchServiceHandlerDecorator.java:37)     at cpw.mods.modlauncher.LaunchServiceHandler.launch(LaunchServiceHandler.java:54)     at cpw.mods.modlauncher.LaunchServiceHandler.launch(LaunchServiceHandler.java:72)     at cpw.mods.modlauncher.Launcher.run(Launcher.java:81)     at cpw.mods.modlauncher.Launcher.main(Launcher.java:65) -- System Details -- Details:     Minecraft Version: 1.15.2     Minecraft Version ID: 1.15.2     Operating System: Windows 10 (amd64) version 10.0     Java Version: 1.8.0_51, Oracle Corporation     Java VM Version: Java HotSpot(TM) 64-Bit Server VM (mixed mode), Oracle Corporation     Memory: 2437440464 bytes (2324 MB) / 4294967296 bytes (4096 MB) up to 4294967296 bytes (4096 MB)     CPUs: 4     JVM Flags: 9 total; -XX:HeapDumpPath=MojangTricksIntelDriversForPerformance_javaw.exe_minecraft.exe.heapdump -Xss1M -Xmx4G -XX:+UnlockExperimentalVMOptions -XX:+UseG1GC -XX:G1NewSizePercent=20 -XX:G1ReservePercent=20 -XX:MaxGCPauseMillis=50 -XX:G1HeapRegionSize=32M     ModLauncher: 5.1.0+69+master.79f13f7     ModLauncher launch target: fmlclient     ModLauncher naming: srg     ModLauncher services:          /eventbus-2.2.0-service.jar eventbus PLUGINSERVICE          /forge-1.15.2-31.2.5.jar object_holder_definalize PLUGINSERVICE          /forge-1.15.2-31.2.5.jar runtime_enum_extender PLUGINSERVICE          /accesstransformers-2.1.1-shadowed.jar accesstransformer PLUGINSERVICE          /forge-1.15.2-31.2.5.jar capability_inject_definalize PLUGINSERVICE          /forge-1.15.2-31.2.5.jar runtimedistcleaner PLUGINSERVICE          /forge-1.15.2-31.2.5.jar fml TRANSFORMATIONSERVICE          /MixinBootstrap-1.0.3.jar mixinbootstrap TRANSFORMATIONSERVICE          /MixinBootstrap-1.0.3.jar mixin PLUGINSERVICE          /MixinBootstrap-1.0.3.jar mixinbootstrap PLUGINSERVICE      FML: 31.2     Forge: net.minecraftforge:31.2.5     FML Language Providers:          javafml@31.2         minecraft@1     Mod List:          forge-1.15.2-31.2.5-client.jar Minecraft {minecraft@1.15.2 CREATE_REGISTRIES}         Lucky-Block-Mod-1.15.2.jar Lucky Block {lucky@1.15.2-1 CREATE_REGISTRIES}         OpenBlocks-Elevator-Mod-1.15.2.jar Elevator Mod {elevatorid@1.15.2-1.5.5 CREATE_REGISTRIES}         PattysMoreTools-2-Mod-1.15.2.jar PattysMoreTools-2 {pattysmoretools@2.5 CREATE_REGISTRIES}         obfuscate-0.4.1-1.15.2.jar Obfuscate {obfuscate@0.4.1 CREATE_REGISTRIES}         u_team_core-1.15.2-2.11.0.156.jar U Team Core {uteamcore@2.11.0.156 CREATE_REGISTRIES}         nethercraft-1.15.2-1.0.8.jar Nethercraft {nethercraft@1.0.8 CREATE_REGISTRIES}         MrCrayfishs-Furniture-Mod-1.15.2.jar MrCrayfish's Furniture Mod {cfm@7.0.0-pre16 CREATE_REGISTRIES}         MrCrayfishs-Vehicle-Mod-1.15.2.jar MrCrayfish's Vehicle Mod {vehicle@0.43.3 CREATE_REGISTRIES}         jei-1.15.2-6.0.0.2.jar Just Enough Items {jei@6.0.0.2 CREATE_REGISTRIES}         simplefarming-1.15.2-1.2.7.jar Simple Farming {simplefarming@1.15.2-1.2.7 CREATE_REGISTRIES}         Get-In-The-Bucket-Mod-1.15.2.jar Get In The Bucket Mod {getinthebucketmod@2.2.0 CREATE_REGISTRIES}         forge-1.15.2-31.2.5-universal.jar Forge {forge@31.2.5 CREATE_REGISTRIES}         Upgrade-Aquatic-Mod-1.15.2.jar Upgrade Aquatic {upgrade_aquatic@1.5.1 CREATE_REGISTRIES}         Extra-Golems-Mod-1.15.2.jar Extra Golems {golems@10.0.0-beta CREATE_REGISTRIES}         PattysMoreStuff-Mod-1.15.2.jar pattysmorestuff {pattysmorestuff@1.2.4 CREATE_REGISTRIES}         Explorercraft-1.15.2-4.0.1.jar Explorercraft {explorercraft@1.15.2-4.0.1 ERROR}         Neat+1.6-20.jar Neat {neat@1.6-20 CREATE_REGISTRIES}         Iron-Chests-Mod-1.15.2.jar Iron Chests {ironchest@1.15.2-10.0.1 CREATE_REGISTRIES}         AutoRegLib-1.15.2.jar AutoRegLib {autoreglib@1.5-40 CREATE_REGISTRIES}         Quark-Mod-1.15.2.jar Quark {quark@r2.1-224 CREATE_REGISTRIES}         [1.15.2]+SecurityCraft+v1.8.16.jar SecurityCraft {securitycraft@v1.8.16 CREATE_REGISTRIES}     Launched Version: 1.15.2-forge-31.2.5     Backend library: LWJGL version 3.2.2 build 10     Backend API: GeForce GT 1030/PCIe/SSE2 GL version 4.6.0 NVIDIA 442.50, NVIDIA Corporation     GL Caps: Using framebuffer using OpenGL 3.0     Using VBOs: Yes     Is Modded: Definitely; Client brand changed to 'forge'     Type: Client (map_client.txt)     Resource Packs:      Current Language: ~~ERROR~~ NullPointerException: null     CPU: 4x Intel(R) Core(TM) i5-2500 CPU @ 3.30GHz
    • When running this in the terminal in IntelliJ IDEA: gradlew genIntellijRuns --stacktrace --debug --scan   I get this error. Please can someone help me with this issue as I am a novice when it comes to modding and if more information is needed please tell me as I'm happy to give more. Sorry if this problem is trivial and simple to solve, I am just inexperienced.   15:47:01.448 [ERROR] [org.gradle.internal.buildevents.BuildExceptionReporter] 15:47:01.450 [ERROR] [org.gradle.internal.buildevents.BuildExceptionReporter] FAILURE: Build failed with an exception. 15:47:01.450 [ERROR] [org.gradle.internal.buildevents.BuildExceptionReporter] 15:47:01.451 [ERROR] [org.gradle.internal.buildevents.BuildExceptionReporter] * What went wrong: 15:47:01.452 [ERROR] [org.gradle.internal.buildevents.BuildExceptionReporter] A problem occurred configuring root project 'TutorialMod'. 15:47:01.453 [ERROR] [org.gradle.internal.buildevents.BuildExceptionReporter] > Invalid patcher dependency: de.oceanlabs.mcp:mcp_config:1.15.2-20200515.085601@zip 15:47:01.454 [ERROR] [org.gradle.internal.buildevents.BuildExceptionReporter] 15:47:01.454 [ERROR] [org.gradle.internal.buildevents.BuildExceptionReporter] * Try: 15:47:01.454 [ERROR] [org.gradle.internal.buildevents.BuildExceptionReporter]  Run with --scan to get full insights. 15:47:01.455 [ERROR] [org.gradle.internal.buildevents.BuildExceptionReporter] 15:47:01.456 [ERROR] [org.gradle.internal.buildevents.BuildExceptionReporter] * Exception is: 15:47:01.461 [ERROR] [org.gradle.internal.buildevents.BuildExceptionReporter] org.gradle.api.ProjectConfigurationException: A problem occurred configuring root project 'TutorialMod'. 15:47:01.461 [ERROR] [org.gradle.internal.buildevents.BuildExceptionReporter]   at org.gradle.configuration.project.LifecycleProjectEvaluator.wrapException(LifecycleProjectEvaluator.java:79) 15:47:01.462 [ERROR] [org.gradle.internal.buildevents.BuildExceptionReporter]   at org.gradle.configuration.project.LifecycleProjectEvaluator.addConfigurationFailure(LifecycleProjectEvaluator.java:73) 15:47:01.462 [ERROR] [org.gradle.internal.buildevents.BuildExceptionReporter]   at org.gradle.configuration.project.LifecycleProjectEvaluator.access$400(LifecycleProjectEvaluator.java:54) 15:47:01.462 [ERROR] [org.gradle.internal.buildevents.BuildExceptionReporter]   at org.gradle.configuration.project.LifecycleProjectEvaluator$NotifyAfterEvaluate.run(LifecycleProjectEvaluator.java:200) 15:47:01.462 [ERROR] [org.gradle.internal.buildevents.BuildExceptionReporter]   at org.gradle.internal.operations.DefaultBuildOperationExecutor$RunnableBuildOperationWorker.execute(DefaultBuildOperationExecutor.java:301) 15:47:01.463 [ERROR] [org.gradle.internal.buildevents.BuildExceptionReporter]   at org.gradle.internal.operations.DefaultBuildOperationExecutor$RunnableBuildOperationWorker.execute(DefaultBuildOperationExecutor.java:293) 15:47:01.463 [ERROR] [org.gradle.internal.buildevents.BuildExceptionReporter]   at org.gradle.internal.operations.DefaultBuildOperationExecutor.execute(DefaultBuildOperationExecutor.java:175) 15:47:01.463 [ERROR] [org.gradle.internal.buildevents.BuildExceptionReporter]   at org.gradle.internal.operations.DefaultBuildOperationExecutor.run(DefaultBuildOperationExecutor.java:91) 15:47:01.463 [ERROR] [org.gradle.internal.buildevents.BuildExceptionReporter]   at org.gradle.internal.operations.DelegatingBuildOperationExecutor.run(DelegatingBuildOperationExecutor.java:31) 15:47:01.464 [ERROR] [org.gradle.internal.buildevents.BuildExceptionReporter]   at org.gradle.configuration.project.LifecycleProjectEvaluator$EvaluateProject.run(LifecycleProjectEvaluator.java:110) 15:47:01.464 [ERROR] [org.gradle.internal.buildevents.BuildExceptionReporter]   at org.gradle.internal.operations.DefaultBuildOperationExecutor$RunnableBuildOperationWorker.execute(DefaultBuildOperationExecutor.java:301) 15:47:01.464 [ERROR] [org.gradle.internal.buildevents.BuildExceptionReporter]   at org.gradle.internal.operations.DefaultBuildOperationExecutor$RunnableBuildOperationWorker.execute(DefaultBuildOperationExecutor.java:293) 15:47:01.464 [ERROR] [org.gradle.internal.buildevents.BuildExceptionReporter]   at org.gradle.internal.operations.DefaultBuildOperationExecutor.execute(DefaultBuildOperationExecutor.java:175) 15:47:01.465 [ERROR] [org.gradle.internal.buildevents.BuildExceptionReporter]   at org.gradle.internal.operations.DefaultBuildOperationExecutor.run(DefaultBuildOperationExecutor.java:91) 15:47:01.465 [ERROR] [org.gradle.internal.buildevents.BuildExceptionReporter]   at org.gradle.internal.operations.DelegatingBuildOperationExecutor.run(DelegatingBuildOperationExecutor.java:31) 15:47:01.465 [ERROR] [org.gradle.internal.buildevents.BuildExceptionReporter]   at org.gradle.configuration.project.LifecycleProjectEvaluator.evaluate(LifecycleProjectEvaluator.java:68) 15:47:01.465 [ERROR] [org.gradle.internal.buildevents.BuildExceptionReporter]   at org.gradle.api.internal.project.DefaultProject.evaluate(DefaultProject.java:687) 15:47:01.465 [ERROR] [org.gradle.internal.buildevents.BuildExceptionReporter]   at org.gradle.api.internal.project.DefaultProject.evaluate(DefaultProject.java:140) 15:47:01.466 [ERROR] [org.gradle.internal.buildevents.BuildExceptionReporter]   at org.gradle.execution.TaskPathProjectEvaluator.configure(TaskPathProjectEvaluator.java:35) 15:47:01.466 [ERROR] [org.gradle.internal.buildevents.BuildExceptionReporter]   at org.gradle.execution.TaskPathProjectEvaluator.configureHierarchy(TaskPathProjectEvaluator.java:60) 15:47:01.466 [ERROR] [org.gradle.internal.buildevents.BuildExceptionReporter]   at org.gradle.configuration.DefaultBuildConfigurer.configure(DefaultBuildConfigurer.java:41) 15:47:01.467 [ERROR] [org.gradle.internal.buildevents.BuildExceptionReporter]   at org.gradle.initialization.DefaultGradleLauncher$ConfigureBuild.run(DefaultGradleLauncher.java:274) 15:47:01.467 [ERROR] [org.gradle.internal.buildevents.BuildExceptionReporter]   at org.gradle.internal.operations.DefaultBuildOperationExecutor$RunnableBuildOperationWorker.execute(DefaultBuildOperationExecutor.java:301) 15:47:01.467 [ERROR] [org.gradle.internal.buildevents.BuildExceptionReporter]   at org.gradle.internal.operations.DefaultBuildOperationExecutor$RunnableBuildOperationWorker.execute(DefaultBuildOperationExecutor.java:293) 15:47:01.468 [ERROR] [org.gradle.internal.buildevents.BuildExceptionReporter]   at org.gradle.internal.operations.DefaultBuildOperationExecutor.execute(DefaultBuildOperationExecutor.java:175) 15:47:01.468 [ERROR] [org.gradle.internal.buildevents.BuildExceptionReporter]   at org.gradle.internal.operations.DefaultBuildOperationExecutor.run(DefaultBuildOperationExecutor.java:91) 15:47:01.469 [ERROR] [org.gradle.internal.buildevents.BuildExceptionReporter]   at org.gradle.internal.operations.DelegatingBuildOperationExecutor.run(DelegatingBuildOperationExecutor.java:31) 15:47:01.469 [ERROR] [org.gradle.internal.buildevents.BuildExceptionReporter]   at org.gradle.initialization.DefaultGradleLauncher.configureBuild(DefaultGradleLauncher.java:182) 15:47:01.469 [ERROR] [org.gradle.internal.buildevents.BuildExceptionReporter]   at org.gradle.initialization.DefaultGradleLauncher.doBuildStages(DefaultGradleLauncher.java:141) 15:47:01.469 [ERROR] [org.gradle.internal.buildevents.BuildExceptionReporter]   at org.gradle.initialization.DefaultGradleLauncher.executeTasks(DefaultGradleLauncher.java:124) 15:47:01.470 [ERROR] [org.gradle.internal.buildevents.BuildExceptionReporter]   at org.gradle.internal.invocation.GradleBuildController$1.call(GradleBuildController.java:77) 15:47:01.472 [ERROR] [org.gradle.internal.buildevents.BuildExceptionReporter]   at org.gradle.internal.invocation.GradleBuildController$1.call(GradleBuildController.java:74) 15:47:01.473 [ERROR] [org.gradle.internal.buildevents.BuildExceptionReporter]   at org.gradle.internal.work.DefaultWorkerLeaseService.withLocks(DefaultWorkerLeaseService.java:154) 15:47:01.473 [ERROR] [org.gradle.internal.buildevents.BuildExceptionReporter]   at org.gradle.internal.work.StopShieldingWorkerLeaseService.withLocks(StopShieldingWorkerLeaseService.java:38) 15:47:01.473 [ERROR] [org.gradle.internal.buildevents.BuildExceptionReporter]   at org.gradle.internal.invocation.GradleBuildController.doBuild(GradleBuildController.java:96) 15:47:01.474 [ERROR] [org.gradle.internal.buildevents.BuildExceptionReporter]   at org.gradle.internal.invocation.GradleBuildController.run(GradleBuildController.java:74) 15:47:01.474 [ERROR] [org.gradle.internal.buildevents.BuildExceptionReporter]   at org.gradle.tooling.internal.provider.ExecuteBuildActionRunner.run(ExecuteBuildActionRunner.java:28) 15:47:01.474 [ERROR] [org.gradle.internal.buildevents.BuildExceptionReporter]   at org.gradle.launcher.exec.ChainingBuildActionRunner.run(ChainingBuildActionRunner.java:35) 15:47:01.474 [ERROR] [org.gradle.internal.buildevents.BuildExceptionReporter]   at org.gradle.tooling.internal.provider.ValidatingBuildActionRunner.run(ValidatingBuildActionRunner.java:32) 15:47:01.475 [ERROR] [org.gradle.internal.buildevents.BuildExceptionReporter]   at org.gradle.launcher.exec.RunAsBuildOperationBuildActionRunner$3.run(RunAsBuildOperationBuildActionRunner.java:50) 15:47:01.475 [ERROR] [org.gradle.internal.buildevents.BuildExceptionReporter]   at org.gradle.internal.operations.DefaultBuildOperationExecutor$RunnableBuildOperationWorker.execute(DefaultBuildOperationExecutor.java:301) 15:47:01.475 [ERROR] [org.gradle.internal.buildevents.BuildExceptionReporter]   at org.gradle.internal.operations.DefaultBuildOperationExecutor$RunnableBuildOperationWorker.execute(DefaultBuildOperationExecutor.java:293) 15:47:01.475 [ERROR] [org.gradle.internal.buildevents.BuildExceptionReporter]   at org.gradle.internal.operations.DefaultBuildOperationExecutor.execute(DefaultBuildOperationExecutor.java:175) 15:47:01.475 [ERROR] [org.gradle.internal.buildevents.BuildExceptionReporter]   at org.gradle.internal.operations.DefaultBuildOperationExecutor.run(DefaultBuildOperationExecutor.java:91) 15:47:01.476 [ERROR] [org.gradle.internal.buildevents.BuildExceptionReporter]   at org.gradle.internal.operations.DelegatingBuildOperationExecutor.run(DelegatingBuildOperationExecutor.java:31) 15:47:01.476 [ERROR] [org.gradle.internal.buildevents.BuildExceptionReporter]   at org.gradle.launcher.exec.RunAsBuildOperationBuildActionRunner.run(RunAsBuildOperationBuildActionRunner.java:45) 15:47:01.476 [ERROR] [org.gradle.internal.buildevents.BuildExceptionReporter]   at org.gradle.tooling.internal.provider.SubscribableBuildActionRunner.run(SubscribableBuildActionRunner.java:51) 15:47:01.478 [ERROR] [org.gradle.internal.buildevents.BuildExceptionReporter]   at org.gradle.launcher.exec.InProcessBuildActionExecuter$1.transform(InProcessBuildActionExecuter.java:47) 15:47:01.479 [ERROR] [org.gradle.internal.buildevents.BuildExceptionReporter]   at org.gradle.launcher.exec.InProcessBuildActionExecuter$1.transform(InProcessBuildActionExecuter.java:44) 15:47:01.479 [ERROR] [org.gradle.internal.buildevents.BuildExceptionReporter]   at org.gradle.composite.internal.DefaultRootBuildState.run(DefaultRootBuildState.java:79) 15:47:01.479 [ERROR] [org.gradle.internal.buildevents.BuildExceptionReporter]   at org.gradle.launcher.exec.InProcessBuildActionExecuter.execute(InProcessBuildActionExecuter.java:44) 15:47:01.479 [ERROR] [org.gradle.internal.buildevents.BuildExceptionReporter]   at org.gradle.launcher.exec.InProcessBuildActionExecuter.execute(InProcessBuildActionExecuter.java:30) 15:47:01.480 [ERROR] [org.gradle.internal.buildevents.BuildExceptionReporter]   at org.gradle.launcher.exec.BuildTreeScopeBuildActionExecuter.execute(BuildTreeScopeBuildActionExecuter.java:39) 15:47:01.480 [ERROR] [org.gradle.internal.buildevents.BuildExceptionReporter]   at org.gradle.launcher.exec.BuildTreeScopeBuildActionExecuter.execute(BuildTreeScopeBuildActionExecuter.java:25) 15:47:01.480 [ERROR] [org.gradle.internal.buildevents.BuildExceptionReporter]   at org.gradle.tooling.internal.provider.ContinuousBuildActionExecuter.execute(ContinuousBuildActionExecuter.java:80) 15:47:01.480 [ERROR] [org.gradle.internal.buildevents.BuildExceptionReporter]   at org.gradle.tooling.internal.provider.ContinuousBuildActionExecuter.execute(ContinuousBuildActionExecuter.java:53) 15:47:01.481 [ERROR] [org.gradle.internal.buildevents.BuildExceptionReporter]   at org.gradle.tooling.internal.provider.ServicesSetupBuildActionExecuter.execute(ServicesSetupBuildActionExecuter.java:62) 15:47:01.482 [ERROR] [org.gradle.internal.buildevents.BuildExceptionReporter]   at org.gradle.tooling.internal.provider.ServicesSetupBuildActionExecuter.execute(ServicesSetupBuildActionExecuter.java:34) 15:47:01.482 [ERROR] [org.gradle.internal.buildevents.BuildExceptionReporter]   at org.gradle.tooling.internal.provider.GradleThreadBuildActionExecuter.execute(GradleThreadBuildActionExecuter.java:36) 15:47:01.483 [ERROR] [org.gradle.internal.buildevents.BuildExceptionReporter]   at org.gradle.tooling.internal.provider.GradleThreadBuildActionExecuter.execute(GradleThreadBuildActionExecuter.java:25) 15:47:01.483 [ERROR] [org.gradle.internal.buildevents.BuildExceptionReporter]   at org.gradle.tooling.internal.provider.ParallelismConfigurationBuildActionExecuter.execute(ParallelismConfigurationBuildActionExecuter.java:43) 15:47:01.483 [ERROR] [org.gradle.internal.buildevents.BuildExceptionReporter]   at org.gradle.tooling.internal.provider.ParallelismConfigurationBuildActionExecuter.execute(ParallelismConfigurationBuildActionExecuter.java:29) 15:47:01.483 [ERROR] [org.gradle.internal.buildevents.BuildExceptionReporter]   at org.gradle.tooling.internal.provider.StartParamsValidatingActionExecuter.execute(StartParamsValidatingActionExecuter.java:59) 15:47:01.483 [ERROR] [org.gradle.internal.buildevents.BuildExceptionReporter]   at org.gradle.tooling.internal.provider.StartParamsValidatingActionExecuter.execute(StartParamsValidatingActionExecuter.java:31) 15:47:01.484 [ERROR] [org.gradle.internal.buildevents.BuildExceptionReporter]   at org.gradle.tooling.internal.provider.SessionFailureReportingActionExecuter.execute(SessionFailureReportingActionExecuter.java:59) 15:47:01.484 [ERROR] [org.gradle.internal.buildevents.BuildExceptionReporter]   at org.gradle.tooling.internal.provider.SessionFailureReportingActionExecuter.execute(SessionFailureReportingActionExecuter.java:44) 15:47:01.484 [ERROR] [org.gradle.internal.buildevents.BuildExceptionReporter]   at org.gradle.tooling.internal.provider.SetupLoggingActionExecuter.execute(SetupLoggingActionExecuter.java:46) 15:47:01.484 [ERROR] [org.gradle.internal.buildevents.BuildExceptionReporter]   at org.gradle.tooling.internal.provider.SetupLoggingActionExecuter.execute(SetupLoggingActionExecuter.java:30) 15:47:01.484 [ERROR] [org.gradle.internal.buildevents.BuildExceptionReporter]   at org.gradle.launcher.daemon.server.exec.ExecuteBuild.doBuild(ExecuteBuild.java:67) 15:47:01.485 [ERROR] [org.gradle.internal.buildevents.BuildExceptionReporter]   at org.gradle.launcher.daemon.server.exec.BuildCommandOnly.execute(BuildCommandOnly.java:36) 15:47:01.485 [ERROR] [org.gradle.internal.buildevents.BuildExceptionReporter]   at org.gradle.launcher.daemon.server.api.DaemonCommandExecution.proceed(DaemonCommandExecution.java:122) 15:47:01.485 [ERROR] [org.gradle.internal.buildevents.BuildExceptionReporter]   at org.gradle.launcher.daemon.server.exec.WatchForDisconnection.execute(WatchForDisconnection.java:37) 15:47:01.486 [ERROR] [org.gradle.internal.buildevents.BuildExceptionReporter]   at org.gradle.launcher.daemon.server.api.DaemonCommandExecution.proceed(DaemonCommandExecution.java:122) 15:47:01.486 [ERROR] [org.gradle.internal.buildevents.BuildExceptionReporter]   at org.gradle.launcher.daemon.server.exec.ResetDeprecationLogger.execute(ResetDeprecationLogger.java:26) 15:47:01.486 [ERROR] [org.gradle.internal.buildevents.BuildExceptionReporter]   at org.gradle.launcher.daemon.server.api.DaemonCommandExecution.proceed(DaemonCommandExecution.java:122) 15:47:01.486 [ERROR] [org.gradle.internal.buildevents.BuildExceptionReporter]   at org.gradle.launcher.daemon.server.exec.RequestStopIfSingleUsedDaemon.execute(RequestStopIfSingleUsedDaemon.java:34) 15:47:01.488 [ERROR] [org.gradle.internal.buildevents.BuildExceptionReporter]   at org.gradle.launcher.daemon.server.api.DaemonCommandExecution.proceed(DaemonCommandExecution.java:122) 15:47:01.489 [ERROR] [org.gradle.internal.buildevents.BuildExceptionReporter]   at org.gradle.launcher.daemon.server.exec.ForwardClientInput$2.call(ForwardClientInput.java:74) 15:47:01.489 [ERROR] [org.gradle.internal.buildevents.BuildExceptionReporter]   at org.gradle.launcher.daemon.server.exec.ForwardClientInput$2.call(ForwardClientInput.java:72) 15:47:01.489 [ERROR] [org.gradle.internal.buildevents.BuildExceptionReporter]   at org.gradle.util.Swapper.swap(Swapper.java:38) 15:47:01.489 [ERROR] [org.gradle.internal.buildevents.BuildExceptionReporter]   at org.gradle.launcher.daemon.server.exec.ForwardClientInput.execute(ForwardClientInput.java:72) 15:47:01.490 [ERROR] [org.gradle.internal.buildevents.BuildExceptionReporter]   at org.gradle.launcher.daemon.server.api.DaemonCommandExecution.proceed(DaemonCommandExecution.java:122) 15:47:01.490 [ERROR] [org.gradle.internal.buildevents.BuildExceptionReporter]   at org.gradle.launcher.daemon.server.exec.LogAndCheckHealth.execute(LogAndCheckHealth.java:50) 15:47:01.490 [ERROR] [org.gradle.internal.buildevents.BuildExceptionReporter]   at org.gradle.launcher.daemon.server.api.DaemonCommandExecution.proceed(DaemonCommandExecution.java:122) 15:47:01.490 [ERROR] [org.gradle.internal.buildevents.BuildExceptionReporter]   at org.gradle.launcher.daemon.server.exec.LogToClient.doBuild(LogToClient.java:62) 15:47:01.490 [ERROR] [org.gradle.internal.buildevents.BuildExceptionReporter]   at org.gradle.launcher.daemon.server.exec.BuildCommandOnly.execute(BuildCommandOnly.java:36) 15:47:01.490 [ERROR] [org.gradle.internal.buildevents.BuildExceptionReporter]   at org.gradle.launcher.daemon.server.api.DaemonCommandExecution.proceed(DaemonCommandExecution.java:122) 15:47:01.491 [ERROR] [org.gradle.internal.buildevents.BuildExceptionReporter]   at org.gradle.launcher.daemon.server.exec.EstablishBuildEnvironment.doBuild(EstablishBuildEnvironment.java:81) 15:47:01.491 [ERROR] [org.gradle.internal.buildevents.BuildExceptionReporter]   at org.gradle.launcher.daemon.server.exec.BuildCommandOnly.execute(BuildCommandOnly.java:36) 15:47:01.491 [ERROR] [org.gradle.internal.buildevents.BuildExceptionReporter]   at org.gradle.launcher.daemon.server.api.DaemonCommandExecution.proceed(DaemonCommandExecution.java:122) 15:47:01.491 [ERROR] [org.gradle.internal.buildevents.BuildExceptionReporter]   at org.gradle.launcher.daemon.server.exec.StartBuildOrRespondWithBusy$1.run(StartBuildOrRespondWithBusy.java:50) 15:47:01.491 [ERROR] [org.gradle.internal.buildevents.BuildExceptionReporter]   at org.gradle.launcher.daemon.server.DaemonStateCoordinator$1.run(DaemonStateCoordinator.java:295) 15:47:01.492 [ERROR] [org.gradle.internal.buildevents.BuildExceptionReporter]   at org.gradle.internal.concurrent.ExecutorPolicy$CatchAndRecordFailures.onExecute(ExecutorPolicy.java:63) 15:47:01.492 [ERROR] [org.gradle.internal.buildevents.BuildExceptionReporter]   at org.gradle.internal.concurrent.ManagedExecutorImpl$1.run(ManagedExecutorImpl.java:46) 15:47:01.492 [ERROR] [org.gradle.internal.buildevents.BuildExceptionReporter]   at org.gradle.internal.concurrent.ThreadFactoryImpl$ManagedThreadRunnable.run(ThreadFactoryImpl.java:55) 15:47:01.492 [ERROR] [org.gradle.internal.buildevents.BuildExceptionReporter] Caused by: java.lang.RuntimeException: Invalid patcher dependency: de.oceanlabs.mcp:mcp_config:1.15.2-20200515.085601@zip 15:47:01.492 [ERROR] [org.gradle.internal.buildevents.BuildExceptionReporter]   at net.minecraftforge.gradle.userdev.MinecraftUserRepo$MCP.<init>(MinecraftUserRepo.java:1527) 15:47:01.492 [ERROR] [org.gradle.internal.buildevents.BuildExceptionReporter]   at net.minecraftforge.gradle.userdev.MinecraftUserRepo$MCP.<init>(MinecraftUserRepo.java:1473) 15:47:01.493 [ERROR] [org.gradle.internal.buildevents.BuildExceptionReporter]   at net.minecraftforge.gradle.userdev.MinecraftUserRepo.getParents(MinecraftUserRepo.java:364) 15:47:01.493 [ERROR] [org.gradle.internal.buildevents.BuildExceptionReporter]   at net.minecraftforge.gradle.userdev.MinecraftUserRepo.validate(MinecraftUserRepo.java:174) 15:47:01.493 [ERROR] [org.gradle.internal.buildevents.BuildExceptionReporter]   at net.minecraftforge.gradle.userdev.UserDevPlugin.lambda$apply$18(UserDevPlugin.java:286) 15:47:01.493 [ERROR] [org.gradle.internal.buildevents.BuildExceptionReporter]   at org.gradle.configuration.internal.DefaultListenerBuildOperationDecorator$BuildOperationEmittingAction$1$1.run(DefaultListenerBuildOperationDecorator. java:157) 15:47:01.493 [ERROR] [org.gradle.internal.buildevents.BuildExceptionReporter]   at org.gradle.configuration.internal.DefaultUserCodeApplicationContext.reapply(DefaultUserCodeApplicationContext.java:58) 15:47:01.494 [ERROR] [org.gradle.internal.buildevents.BuildExceptionReporter]   at org.gradle.configuration.internal.DefaultListenerBuildOperationDecorator$BuildOperationEmittingAction$1.run(DefaultListenerBuildOperationDecorator.ja va:154) 15:47:01.494 [ERROR] [org.gradle.internal.buildevents.BuildExceptionReporter]   at org.gradle.internal.operations.DefaultBuildOperationExecutor$RunnableBuildOperationWorker.execute(DefaultBuildOperationExecutor.java:301) 15:47:01.494 [ERROR] [org.gradle.internal.buildevents.BuildExceptionReporter]   at org.gradle.internal.operations.DefaultBuildOperationExecutor$RunnableBuildOperationWorker.execute(DefaultBuildOperationExecutor.java:293) 15:47:01.495 [ERROR] [org.gradle.internal.buildevents.BuildExceptionReporter]   at org.gradle.internal.operations.DefaultBuildOperationExecutor.execute(DefaultBuildOperationExecutor.java:175) 15:47:01.495 [ERROR] [org.gradle.internal.buildevents.BuildExceptionReporter]   at org.gradle.internal.operations.DefaultBuildOperationExecutor.run(DefaultBuildOperationExecutor.java:91) 15:47:01.495 [ERROR] [org.gradle.internal.buildevents.BuildExceptionReporter]   at org.gradle.configuration.internal.DefaultListenerBuildOperationDecorator$BuildOperationEmittingAction.execute(DefaultListenerBuildOperationDecorator. java:151) 15:47:01.496 [ERROR] [org.gradle.internal.buildevents.BuildExceptionReporter]   at org.gradle.internal.event.BroadcastDispatch$ActionInvocationHandler.dispatch(BroadcastDispatch.java:91) 15:47:01.497 [ERROR] [org.gradle.internal.buildevents.BuildExceptionReporter]   at org.gradle.internal.event.BroadcastDispatch$ActionInvocationHandler.dispatch(BroadcastDispatch.java:80) 15:47:01.498 [ERROR] [org.gradle.internal.buildevents.BuildExceptionReporter]   at org.gradle.internal.event.AbstractBroadcastDispatch.dispatch(AbstractBroadcastDispatch.java:42) 15:47:01.498 [ERROR] [org.gradle.internal.buildevents.BuildExceptionReporter]   at org.gradle.internal.event.BroadcastDispatch$SingletonDispatch.dispatch(BroadcastDispatch.java:230) 15:47:01.499 [ERROR] [org.gradle.internal.buildevents.BuildExceptionReporter]   at org.gradle.internal.event.BroadcastDispatch$SingletonDispatch.dispatch(BroadcastDispatch.java:149) 15:47:01.499 [ERROR] [org.gradle.internal.buildevents.BuildExceptionReporter]   at org.gradle.internal.event.AbstractBroadcastDispatch.dispatch(AbstractBroadcastDispatch.java:58) 15:47:01.500 [ERROR] [org.gradle.internal.buildevents.BuildExceptionReporter]   at org.gradle.internal.event.BroadcastDispatch$CompositeDispatch.dispatch(BroadcastDispatch.java:324) 15:47:01.500 [ERROR] [org.gradle.internal.buildevents.BuildExceptionReporter]   at org.gradle.internal.event.BroadcastDispatch$CompositeDispatch.dispatch(BroadcastDispatch.java:234) 15:47:01.500 [ERROR] [org.gradle.internal.buildevents.BuildExceptionReporter]   at org.gradle.internal.event.ListenerBroadcast.dispatch(ListenerBroadcast.java:140) 15:47:01.500 [ERROR] [org.gradle.internal.buildevents.BuildExceptionReporter]   at org.gradle.internal.event.ListenerBroadcast.dispatch(ListenerBroadcast.java:37) 15:47:01.500 [ERROR] [org.gradle.internal.buildevents.BuildExceptionReporter]   at org.gradle.internal.dispatch.ProxyDispatchAdapter$DispatchingInvocationHandler.invoke(ProxyDispatchAdapter.java:93) 15:47:01.500 [ERROR] [org.gradle.internal.buildevents.BuildExceptionReporter]   at com.sun.proxy.$Proxy28.afterEvaluate(Unknown Source) 15:47:01.501 [ERROR] [org.gradle.internal.buildevents.BuildExceptionReporter]   at org.gradle.configuration.project.LifecycleProjectEvaluator$NotifyAfterEvaluate$1.execute(LifecycleProjectEvaluator.java:187) 15:47:01.501 [ERROR] [org.gradle.internal.buildevents.BuildExceptionReporter]   at org.gradle.configuration.project.LifecycleProjectEvaluator$NotifyAfterEvaluate$1.execute(LifecycleProjectEvaluator.java:184) 15:47:01.501 [ERROR] [org.gradle.internal.buildevents.BuildExceptionReporter]   at org.gradle.api.internal.project.DefaultProject.stepEvaluationListener(DefaultProject.java:1418) 15:47:01.501 [ERROR] [org.gradle.internal.buildevents.BuildExceptionReporter]   at org.gradle.configuration.project.LifecycleProjectEvaluator$NotifyAfterEvaluate.run(LifecycleProjectEvaluator.java:193) 15:47:01.501 [ERROR] [org.gradle.internal.buildevents.BuildExceptionReporter]   ... 91 more 15:47:01.501 [ERROR] [org.gradle.internal.buildevents.BuildExceptionReporter] Caused by: java.util.zip.ZipException: error in opening zip file 15:47:01.502 [ERROR] [org.gradle.internal.buildevents.BuildExceptionReporter]   at net.minecraftforge.gradle.common.util.Utils.getZipData(Utils.java:315) 15:47:01.502 [ERROR] [org.gradle.internal.buildevents.BuildExceptionReporter]   at net.minecraftforge.gradle.mcp.util.MCPWrapper.<init>(MCPWrapper.java:54) 15:47:01.502 [ERROR] [org.gradle.internal.buildevents.BuildExceptionReporter]   at net.minecraftforge.gradle.mcp.util.MCPWrapper.<init>(MCPWrapper.java:47) 15:47:01.502 [ERROR] [org.gradle.internal.buildevents.BuildExceptionReporter]   at net.minecraftforge.gradle.userdev.MinecraftUserRepo$MCP$1.<init>(MinecraftUserRepo.java:1481) 15:47:01.503 [ERROR] [org.gradle.internal.buildevents.BuildExceptionReporter]   at net.minecraftforge.gradle.userdev.MinecraftUserRepo$MCP.<init>(MinecraftUserRepo.java:1481) 15:47:01.503 [ERROR] [org.gradle.internal.buildevents.BuildExceptionReporter]   ... 119 more 15:47:01.503 [ERROR] [org.gradle.internal.buildevents.BuildExceptionReporter] 15:47:01.503 [ERROR] [org.gradle.internal.buildevents.BuildExceptionReporter] 15:47:01.504 [ERROR] [org.gradle.internal.buildevents.BuildExceptionReporter] * Get more help at https://help.gradle.org 15:47:01.504 [WARN] [org.gradle.internal.featurelifecycle.LoggingDeprecatedFeatureHandler] Deprecated Gradle features were used in this build, making it incompatible with Gradle 5.0. Use '--warning-mode all' to show the individual deprecation warnings. See https://docs.gradle.org/4.10.3/userguide/command_line_interface.html#sec:command_line_warnings 15:47:01.506 [ERROR] [org.gradle.internal.buildevents.BuildResultLogger] 15:47:01.506 [ERROR] [org.gradle.internal.buildevents.BuildResultLogger] BUILD FAILED in 24s 15:47:01.863 [QUIET] [com.gradle.scan.plugin.BuildScanPlugin]  
  • Topics

  • Who's Online (See full list)